Loading

Paste #pxenxchqa

  1. x86_64-pc-linux-gnu-g++ -c -march=core2 -mtune=core2 -O2 -pipe -fvisibility=hidden -fvisibility-inlines-hidden -std=c++0x -Wall -W -D_REENTRANT -fPIC -DQT_NO_XCB -DQT_NO_URL_CAST_FROM_STRING -DQT_QMLTEST_WITH_WIDGETS -DQT_BUILD_QMLTEST_LIB -DQT_BUILDING_QT -DQT_NO_CAST_TO_ASCII -DQT_ASCII_CAST_WARNINGS -DQT_MOC_COMPAT -DQT_USE_QSTRINGBUILDER -DQT_DEPRECATED_WARNINGS -DQT_DISABLE_DEPRECATED_BEFORE=0x050000 -DQT_QML_DEBUG_NO_WARNING -D_LARGEFILE64_SOURCE -D_LARGEFILE_SOURCE -DQT_WIDGETS_LIB -DQT_GUI_LIB -DQT_CORE_LIB -DQT_QUICK_LIB -DQT_QML_LIB -DQT_NETWORK_LIB -DQT_GUI_LIB -DQT_TESTLIB_LIB -DQT_CORE_LIB -DQT_TESTCASE_BUILDDIR=\"/var/tmp/portage/dev-qt/qtdeclarative-5.9999/work/qtdeclarative-5.9999_build/src/qmltest\" -I/usr/lib64/qt5/mkspecs/linux-g++ -I/var/tmp/portage/dev-qt/qtdeclarative-5.9999/work/qtdeclarative-5.9999/src/qmltest -I../../include -I../../include/QtQuickTest -I../../include/QtQuickTest/5.3.0 -I../../include/QtQuickTest/5.3.0/QtQuickTest -I/usr/include/qt5 -I/usr/include/qt5/QtWidgets -I/usr/include/qt5/QtGui -I/usr/include/qt5/QtCore -I../../include/QtQuick -I../../include/QtQml -I../../include/QtQml/5.3.0 -I../../include/QtQml/5.3.0/QtQml -I/usr/include/qt5/QtNetwork -I/usr/include/qt5/QtTest -I/usr/include/qt5/QtTest/5.3.0 -I/usr/include/qt5/QtTest/5.3.0/QtTest -I/usr/include/qt5/QtCore/5.3.0 -I/usr/include/qt5/QtCore/5.3.0/QtCore -I.moc/debug-shared -I. -o .obj/debug-shared/quicktest.o /var/tmp/portage/dev-qt/qtdeclarative-5.9999/work/qtdeclarative-5.9999/src/qmltest/quicktest.cpp
  2. /var/tmp/portage/dev-qt/qtdeclarative-5.9999/work/qtdeclarative-5.9999/src/qmltest/quicktestresult.cpp: In static member function 'static void QuickTestResult::setCurrentAppname(const char*)':
  3. /var/tmp/portage/dev-qt/qtdeclarative-5.9999/work/qtdeclarative-5.9999/src/qmltest/quicktestresult.cpp:722:5: error: 'setCurrentAppname' is not a member of 'QTestResult'
  4. make[2]: *** [.obj/debug-shared/quicktestresult.o] Error 1
  5. make[2]: *** Waiting for unfinished jobs....
  6. make[2]: Leaving directory `/var/tmp/portage/dev-qt/qtdeclarative-5.9999/work/qtdeclarative-5.9999_build/src/qmltest'
  7. make[1]: *** [sub-qmltest-make_first-ordered] Error 2
  8. make[1]: Leaving directory `/var/tmp/portage/dev-qt/qtdeclarative-5.9999/work/qtdeclarative-5.9999_build/src'
  9. make: *** [sub-src-make_first] Error 2
  10.  * ERROR: dev-qt/qtdeclarative-5.9999::qt failed (compile phase):
  11.  *   emake failed
  12.  *
  13.